Reaction Details
Target5-hydroxytryptamine receptor 1D
LigandBDBM50083139
Substrate/Competitorn/a
Meas. Tech.ChEMBL_1699 (CHEMBL616906)
IC50 4.3±n/a nM
Citation Russell, MGMatassa, VGPengilley, RRvan Niel, MBSohal, BWatt, APHitzel, LBeer, MSStanton, JABroughton, HBCastro, JL 3-[3-(Piperidin-1-yl)propyl]indoles as highly selective h5-HT(1D) receptor agonists. J Med Chem42:4981-5001 (2000) 5-hydroxytryptamine receptor 1D
Name:5-hydroxytryptamine receptor 1D
Type:G Protein-Coupled Receptor (GPCR)
Mol. Mass.:41920.63
Organism:Homo sapiens (Human)
Description:Receptor binding assays were performed using human clone stably expressed in CHO cells.
Residue:377
BDBM50083139
NameBDBM50083139
Synonyms:(S)-2-(Methyl-{1-[3-(5-[1,2,4]triazol-4-yl-1H-indol-3-yl)-propyl]-piperidin-4-yl}-amino)-2-phenyl-ethanol | CHEMBL342330
TypeSmall organic molecule
Emp. Form.C27H34N6O
Mol. Mass.458.5985
SMILESCN([C@H](CO)c1ccccc1)C1CCN(CCCc2c[nH]c3ccc(cc23)-n2cnnc2)CC1