Reaction Details
Target5-hydroxytryptamine receptor 1D
LigandBDBM50060428
Substrate/Competitorn/a
Meas. Tech.ChEMBL_1699 (CHEMBL616906)
IC50 1.3±n/a nM
Citation Russell, MGMatassa, VGPengilley, RRvan Niel, MBSohal, BWatt, APHitzel, LBeer, MSStanton, JABroughton, HBCastro, JL 3-[3-(Piperidin-1-yl)propyl]indoles as highly selective h5-HT(1D) receptor agonists. J Med Chem42:4981-5001 (2000) 5-hydroxytryptamine receptor 1D
Name:5-hydroxytryptamine receptor 1D
Type:G Protein-Coupled Receptor (GPCR)
Mol. Mass.:41920.63
Organism:Homo sapiens (Human)
Description:Receptor binding assays were performed using human clone stably expressed in CHO cells.
Residue:377
BDBM50060428
NameBDBM50060428
Synonyms:(R)-2-Phenyl-2-{1-[3-(5-[1,2,4]triazol-4-yl-1H-indol-3-yl)-propyl]-piperidin-4-ylamino}-ethanol | CHEMBL118012
TypeSmall organic molecule
Emp. Form.C26H32N6O
Mol. Mass.444.5719
SMILESOC[C@H](NC1CCN(CCCc2c[nH]c3ccc(cc23)-n2cnnc2)CC1)c1ccccc1