Reaction Details
TargetDelta-type opioid receptor
LigandBDBM50083160
Substrate/Competitorn/a
Meas. Tech.ChEMBL_146900 (CHEMBL751113)
Ki 0.073±n/a nM
Citation Salvadori, SGuerrini, RBalboni, GBianchi, CBryant, SDCooper, PSLazarus, LH Further studies on the Dmt-Tic pharmacophore: hydrophobic substituents at the C-terminus endow delta antagonists to manifest mu agonism or mu antagonism. J Med Chem42:5010-9 (2000) Delta-type opioid receptor
Name:Delta-type opioid receptor
Type:G Protein-Coupled Receptor (GPCR)
Mol. Mass.:40465.04
Organism:Rattus norvegicus (rat)
Description:Competition binding assays were using CHO-K1 cell membranes expressing the opioid receptor.
Residue:372
BDBM50083160
NameBDBM50083160
Synonyms:(S)-2-[(S)-2-Amino-3-(4-hydroxy-2,6-dimethyl-phenyl)-propionyl]-1,2,3,4-tetrahydro-isoquinoline-3-carboxylic acid [(S)-1-(adamantan-1-ylcarbamoyl)-ethyl]-amide | CHEMBL343018
TypeSmall organic molecule
Emp. Form.C34H44N4O4
Mol. Mass.572.7376
SMILESC[C@H](NC(=O)[C@@H]1Cc2ccccc2CN1C(=O)[C@@H](N)Cc1c(C)cc(O)cc1C)C(=O)NC12C[C@H]3C[C@H](C[C@H](C3)C1)C2