Reaction Details
TargetMu-type opioid receptor
LigandBDBM50083229
Substrate/Competitorn/a
Meas. Tech.ChEMBL_145602 (CHEMBL749745)
IC50 3300±n/a nM
Citation Kawamoto, HOzaki, SItoh, YMiyaji, MArai, SNakashima, HKato, TOhta, HIwasawa, Y Discovery of the first potent and selective small molecule opioid receptor-like (ORL1) antagonist: 1-[(3R,4R)-1-cyclooctylmethyl-3- hydroxymethyl-4-piperidyl]-3-ethyl-1, 3-dihydro-2H-benzimidazol-2-one (J-113397). J Med Chem42:5061-3 (2000) Mu-type opioid receptor
Name:Mu-type opioid receptor
Type:G Protein-Coupled Receptor (GPCR)
Mol. Mass.:44789.51
Organism:Homo sapiens (Human)
Description:P35372
Residue:400
BDBM50083229
NameBDBM50083229
Synonyms:1-((3S,4S)-1-Cyclooctylmethyl-3-hydroxymethyl-piperidin-4-yl)-3-ethyl-1,3-dihydro-benzoimidazol-2-one | CHEMBL146462
TypeSmall organic molecule
Emp. Form.C24H37N3O2
Mol. Mass.399.5695
SMILESCCn1c2ccccc2n([C@H]2CCN(CC3CCCCCCC3)C[C@@H]2CO)c1=O