Reaction Details
TargetNociceptin receptor
LigandBDBM50083231
Substrate/Competitorn/a
Meas. Tech.ChEMBL_146113 (CHEMBL754582)
IC50 6.8±n/a nM
Citation Kawamoto, HOzaki, SItoh, YMiyaji, MArai, SNakashima, HKato, TOhta, HIwasawa, Y Discovery of the first potent and selective small molecule opioid receptor-like (ORL1) antagonist: 1-[(3R,4R)-1-cyclooctylmethyl-3- hydroxymethyl-4-piperidyl]-3-ethyl-1, 3-dihydro-2H-benzimidazol-2-one (J-113397). J Med Chem42:5061-3 (2000) Nociceptin receptor
Name:Nociceptin receptor
Type:G Protein-Coupled Receptor (GPCR)
Mol. Mass.:40702.87
Organism:Homo sapiens (Human)
Description:P41146
Residue:370
BDBM50083231
NameBDBM50083231
Synonyms:1-(1-Cyclooctylmethyl-piperidin-4-yl)-1,3-dihydro-benzoimidazol-2-one | CHEMBL146191
TypeSmall organic molecule
Emp. Form.C21H31N3O
Mol. Mass.341.4903
SMILESO=c1[nH]c2ccccc2n1C1CCN(CC2CCCCCCC2)CC1