Reaction Details
TargetProthrombin
LigandBDBM50083543
Substrate/Competitorn/a
Meas. Tech.ChEBML_208899
Ki 51000.0±n/a nM
Citation Ono, SKuwahara, STakeuchi, MSakashita, HNaito, YKondo, T Syntheses and evaluation of amidinobenzofuran derivatives as tryptase inhibitors. Bioorg Med Chem Lett9:3285-90 (2000) Prothrombin
Name:Prothrombin
Type:Protein
Mol. Mass.:70029.57
Organism:Homo sapiens (Human)
Description:P00734
Residue:622
BDBM50083543
NameBDBM50083543
Synonyms:1,4-di{4-[5-amino(imino)methylbenzo[b]furan-2-ylcarbonyl]hexahydro-1-pyrazinyl}-1,4-butanedione | CHEMBL109251
TypeSmall organic molecule
Emp. Form.C32H34N8O6
Mol. Mass.626.6624
SMILESNC(=N)c1ccc2oc(cc2c1)C(=O)N1CCN(CC1)C(=O)CCC(=O)N1CCN(CC1)C(=O)c1cc2cc(ccc2o1)C(N)=N