Reaction Details
TargetTryptase beta-2/delta/gamma
LigandBDBM50217307
Substrate/Competitorn/a
Meas. Tech.ChEMBL_210823 (CHEMBL811852)
Ki 13000±n/a nM
Citation Ono, SKuwahara, STakeuchi, MSakashita, HNaito, YKondo, T Syntheses and evaluation of amidinobenzofuran derivatives as tryptase inhibitors. Bioorg Med Chem Lett9:3285-90 (2000) Tryptase beta-2/delta/gamma
Name:Tryptase beta-2/delta/gamma
Synonyms:Tryptase
Type:n/a
Mol. Mass.:n/a
Description:ASSAY_ID of ChEMBL is 1510505
Components:This complex has 3 components.
Component 1
Name:Tryptase gamma
Type:PROTEIN
Mol. Mass.:33817.52
Organism:Homo sapiens (Human)
Description:ChEMBL_210833
Residue:321
Component 2
Name:Tryptase beta-2
Synonyms:TPS2 TRYB2_HUMAN Tryptase II Tryptase-2
Type:PROTEIN
Mol. Mass.:30518.79
Organism:Homo sapiens (Human)
Description:ChEMBL_210702
Residue:275
Component 3
Name:Tryptase delta
Synonyms:Delta-tryptase Mast cell mMCP-7-like TRYD_HUMAN Tryptase-3
Type:PROTEIN
Mol. Mass.:26578.73
Organism:Homo sapiens (Human)
Description:ChEMBL_104777
Residue:242
BDBM50217307
NameBDBM50217307
Synonyms:CHEMBL112900
TypeSmall organic molecule
Emp. Form.C32H46N8O8
Mol. Mass.670.7564
SMILESO=C(COc1ccc(OCC(=O)N2CCN(CC2)C(=O)CC(=O)N2CCNCC2)cc1)N1CCN(CC1)C(=O)CC(=O)N1CCNCC1