Reaction Details
TargetMuscarinic acetylcholine receptor M1
LigandBDBM50083652
Substrate/Competitorn/a
Meas. Tech.ChEBML_138476
Kd 0.030000±n/a nM
Citation Krishnan, VPham, WNMesser, WSPeseckis, SM First fatty acylated dipeptides to affect muscarinic receptor ligand binding. Bioorg Med Chem Lett9:3363-8 (2000) Muscarinic acetylcholine receptor M1
Name:Muscarinic acetylcholine receptor M1
Type:Protein
Mol. Mass.:51442.54
Organism:Homo sapiens (Human)
Description:P11229
Residue:460
BDBM50083652
NameBDBM50083652
Synonyms:CHEMBL112297 | Hexadecanoic acid (S)-2-benzyloxycarbonyl-2-(2-tetradecanoylamino-acetylamino)-ethyl ester
TypeSmall organic molecule
Emp. Form.C42H72N2O6
Mol. Mass.701.0309
(=O)OC[C@H](NC(=O)CNC(=O)CCCCCCCCCCCCC)C(=O)OCc1ccccc1