Reaction Details
TargetMuscarinic acetylcholine receptor M1
LigandBDBM50083651
Substrate/Competitorn/a
Meas. Tech.ChEMBL_138477 (CHEMBL857565)
Ki 0.008±n/a nM
Citation Krishnan, VPham, WNMesser, WSPeseckis, SM First fatty acylated dipeptides to affect muscarinic receptor ligand binding. Bioorg Med Chem Lett9:3363-8 (2000) Muscarinic acetylcholine receptor M1
Name:Muscarinic acetylcholine receptor M1
Type:Protein
Mol. Mass.:51442.54
Organism:Homo sapiens (Human)
Description:P11229
Residue:460
BDBM50083651
NameBDBM50083651
Synonyms:(S)-3-Hydroxy-2-(2-tetradecanoylamino-acetylamino)-propionic acid benzyl ester | CHEMBL115078
TypeSmall organic molecule
Emp. Form.C26H42N2O5
Mol. Mass.462.6221
(=O)NCC(=O)N[C@@H](CO)C(=O)OCc1ccccc1