Reaction Details
TargetMu-type opioid receptor
LigandBDBM50083670
Substrate/Competitorn/a
Meas. Tech.ChEMBL_138857 (CHEMBL747703)
EC50 58±n/a nM
Citation Xu, WHuang, LFBauer, LBhargava, HNDunn, WJ Synthesis and opiate receptor binding properties of 17-methyl-6,7-dehydro-3,14-dihydroxy-4,5alpha-epoxy-6,7:4',5'-pyrimidin omorphinans. Bioorg Med Chem Lett9:3375-80 (2000) Mu-type opioid receptor
Name:Mu-type opioid receptor
Type:G Protein-Coupled Receptor (GPCR)
Mol. Mass.:44789.51
Organism:Homo sapiens (Human)
Description:P35372
Residue:400
BDBM50083670
NameBDBM50083670
Synonyms:19-methyl-7-phenyl-11-oxa-6,8,19-triazahexacyclo[10.9.1.01,10.02,18.04,9.016,22]docosa-4(9),5,7,12,14,16(22)-hexaene-2,13-diol | CHEMBL112656
TypeSmall organic molecule
Emp. Form.C25H23N3O3
Mol. Mass.413.4684
SMILESCN1CCC23C4Oc5c2c(CC1C3(O)Cc1cnc(nc41)-c1ccccc1)ccc5O