Reaction Details
TargetKappa-type opioid receptor
LigandBDBM50083668
Substrate/Competitorn/a
Meas. Tech.ChEMBL_92545 (CHEMBL699591)
EC50 2730±n/a nM
Citation Xu, WHuang, LFBauer, LBhargava, HNDunn, WJ Synthesis and opiate receptor binding properties of 17-methyl-6,7-dehydro-3,14-dihydroxy-4,5alpha-epoxy-6,7:4',5'-pyrimidin omorphinans. Bioorg Med Chem Lett9:3375-80 (2000) Kappa-type opioid receptor
Name:Kappa-type opioid receptor
Type:G Protein-Coupled Receptor (GPCR)
Mol. Mass.:42648.76
Organism:Homo sapiens (Human)
Description:P41145
Residue:380
BDBM50083668
NameBDBM50083668
Synonyms:7,19-dimethyl-11-oxa-6,8,19-triazahexacyclo[10.9.1.01,10.02,18.04,9.016,22]docosa-4(9),5,7,12,14,16(22)-hexaene-2,13-diol | CHEMBL431074
TypeSmall organic molecule
Emp. Form.C20H21N3O3
Mol. Mass.351.399
SMILESCN1CCC23C4Oc5c2c(CC1C3(O)Cc1cnc(C)nc41)ccc5O