Reaction Details
TargetDelta-type opioid receptor
LigandBDBM50083672
Substrate/Competitorn/a
Meas. Tech.ChEMBL_53447 (CHEMBL666297)
Ki 12±n/a nM
Citation Xu, WHuang, LFBauer, LBhargava, HNDunn, WJ Synthesis and opiate receptor binding properties of 17-methyl-6,7-dehydro-3,14-dihydroxy-4,5alpha-epoxy-6,7:4',5'-pyrimidin omorphinans. Bioorg Med Chem Lett9:3375-80 (2000) Delta-type opioid receptor
Name:Delta-type opioid receptor
Type:G Protein-Coupled Receptor (GPCR)
Mol. Mass.:40382.98
Organism:Homo sapiens (Human)
Description:Competition binding assays were carried out using membrane preparations from transfected HN9.10 cells that constitutively expressed the delta opioid receptor.
Residue:372
BDBM50083672
NameBDBM50083672
Synonyms:18-methyl-10-oxa-6,7,18-triazahexacyclo[9.9.1.01,9.02,17.04,8.015,21]henicosa-4(8),5,11,13,15(21)-pentaene-2,12-diol | CHEMBL112035
TypeSmall organic molecule
Emp. Form.C18H19N3O3
Mol. Mass.325.3618
SMILESCN1CCC23C4Oc5c2c(CC1C3(O)Cc1cn[nH]c41)ccc5O