Reaction Details
TargetReverse transcriptase/RNaseH
LigandBDBM50083684
Substrate/Competitorn/a
Meas. Tech.ChEBML_80607
IC50>100000±n/a nM
Citation Uckun, FMPendergrass, SMaher, DZhu, DTuel-Ahlgren, LMao, CVenkatachalam, TK N'-[2-(2-thiophene)ethyl]-N'-[2-(5-bromopyridyl)] thiourea as a potent inhibitor of NNI-resistant and multidrug-resistant human immunodeficiency virus-1. Bioorg Med Chem Lett9:3411-6 (2000) Reverse transcriptase/RNaseH
Name:Reverse transcriptase/RNaseH
Type:PROTEIN
Mol. Mass.:65229.15
Organism:Human immunodeficiency virus 1
Description:ChEMBL_1473730
Residue:566
BDBM50083684
NameBDBM50083684
Synonyms:1-(5-Bromo-pyridin-2-yl)-3-[2-(1-methyl-pyrrolidin-2-yl)-ethyl]-thiourea | CHEMBL117182
TypeSmall organic molecule
Emp. Form.C13H19BrN4S
Mol. Mass.343.286
SMILESCN1CCCC1CCNC(=S)Nc1ccc(Br)cn1