Reaction Details
TargetIntegrin alpha-V/beta-3
LigandBDBM50083762
Substrate/Competitorn/a
Meas. Tech.ChEMBL_79534 (CHEMBL691015)
IC50 75±n/a nM
Citation Miller, WHAlberts, DPBhatnagar, PKBondinell, WECallahan, JFCalvo, RRCousins, RDErhard, KFHeerding, DAKeenan, RMKwon, CManley, PJNewlander, KARoss, STSamanen, JMUzinskas, INVenslavsky, JWYuan, CCHaltiwanger, RCGowen, MHwang, SMJames, IELark, MWRieman, DJStroup, GBAzzarano, LMSalyers, KLSmith, BRWard, KWJohanson, KOHuffman, WF Discovery of orally active nonpeptide vitronectin receptor antagonists based on a 2-benzazepine Gly-Asp mimetic. J Med Chem43:22-6 (2000) Integrin alpha-V/beta-3
Name:Integrin alpha-V/beta-3
Type:Enzyme
Mol. Mass.:n/a
Description:n/a
Components:This complex has 2 components.
Component 1
Name:Integrin alpha-V
Synonyms:ITAV_HUMAN Integrin alpha-V/alpha-5 VNRA Vitronectin receptor | Vitronectin receptor subunit alpha
Type:PROTEIN
Mol. Mass.:116024.92
Organism:Homo sapiens (Human)
Description:ChEMBL_582336
Residue:1048
Component 2
Name:Integrin beta-3
Synonyms:CD_antigen=CD61 GPIIIa ITGB3 Platelet membrane glycoprotein IIIa
Type:Protein
Mol. Mass.:87038.91
Organism:Homo sapiens (Human)
Description:P05106
Residue:788
BDBM50083762
NameBDBM50083762
Synonyms:CHEMBL314022 | {2-Methyl-3-oxo-8-[3-(pyridin-2-ylamino)-propoxy]-2,3,4,5-tetrahydro-1H-benzo[c]azepin-4-yl}-acetic acid
TypeSmall organic molecule
Emp. Form.C21H25N3O4
Mol. Mass.383.4409
SMILESCN1Cc2cc(OCCCNc3ccccn3)ccc2CC(CC(O)=O)C1=O