Reaction Details
TargetCannabinoid receptor 1
LigandBDBM50083863
Substrate/Competitorn/a
Meas. Tech.ChEMBL_46825 (CHEMBL658059)
Kd 36±n/a nM
Citation Keimowitz, ARMartin, BRRazdan, RKCrocker, PJMascarella, SWThomas, BF QSAR analysis of Delta(8)-THC analogues: relationship of side-chain conformation to cannabinoid receptor affinity and pharmacological potency. J Med Chem43:59-70 (2000) Cannabinoid receptor 1
Name:Cannabinoid receptor 1
Type:G Protein-Coupled Receptor (GPCR)
Mol. Mass.:52868.96
Organism:Homo sapiens (Human)
Description:P21554
Residue:472
BDBM50083863
NameBDBM50083863
Synonyms:3-Hept-1-ynyl-6,6,9-trimethyl-6a,7,10,10a-tetrahydro-6H-benzo[c]chromen-1-ol | CHEMBL355598
TypeSmall organic molecule
Emp. Form.C23H30O2
Mol. Mass.338.4831
SMILESCCCCCC#Cc1cc(O)c2C3CC(C)=CCC3C(C)(C)Oc2c1