Reaction Details
TargetProthrombin
LigandBDBM50083957
Substrate/Competitorn/a
Meas. Tech.ChEBML_208342
Ki 11±n/a nM
Citation Soll, RMLu, TTomczuk, BIllig, CRFedde, CEisennagel, SBone, RMurphy, LSpurlino, JSalemme, FR Amidinohydrazones as guanidine bioisosteres: application to a new class of potent, selective and orally bioavailable, non-amide-based small-molecule thrombin inhibitors. Bioorg Med Chem Lett10:1-4 (2000) Prothrombin
Name:Prothrombin
Type:Protein
Mol. Mass.:70029.57
Organism:Homo sapiens (Human)
Description:P00734
Residue:622
BDBM50083957
NameBDBM50083957
Synonyms:3-[((3E)-3-{[(E)-amino(imino)methyl]hydrazono}propyl)oxy]-5-methylphenyl 2-(trifluoromethoxy)benzenesulfonate | CHEMBL340276
TypeSmall organic molecule
Emp. Form.C18H19F3N4O5S
Mol. Mass.460.427
SMILESCc1cc(OCCC=NNC(N)=N)cc(OS(=O)(=O)c2ccccc2OC(F)(F)F)c1