Reaction Details
TargetProthrombin
LigandBDBM50083968
Substrate/Competitorn/a
Meas. Tech.ChEBML_208342
Ki 4.4±n/a nM
Citation Soll, RMLu, TTomczuk, BIllig, CRFedde, CEisennagel, SBone, RMurphy, LSpurlino, JSalemme, FR Amidinohydrazones as guanidine bioisosteres: application to a new class of potent, selective and orally bioavailable, non-amide-based small-molecule thrombin inhibitors. Bioorg Med Chem Lett10:1-4 (2000) Prothrombin
Name:Prothrombin
Type:Protein
Mol. Mass.:70029.57
Organism:Homo sapiens (Human)
Description:P00734
Residue:622
BDBM50083968
NameBDBM50083968
Synonyms:3-[((3E)-3-{[(E)-amino(imino)methyl]hydrazono}propyl)oxy]-5-methylphenyl 2-(trifluoromethyl)benzenesulfonate | CHEMBL435210
TypeSmall organic molecule
Emp. Form.C18H19F3N4O4S
Mol. Mass.444.428
SMILESCc1cc(OCCC=NNC(N)=N)cc(OS(=O)(=O)c2ccccc2C(F)(F)F)c1