Reaction Details
TargetProthrombin
LigandBDBM50083966
Substrate/Competitorn/a
Meas. Tech.ChEBML_208342
Ki 9.2±n/a nM
Citation Soll, RMLu, TTomczuk, BIllig, CRFedde, CEisennagel, SBone, RMurphy, LSpurlino, JSalemme, FR Amidinohydrazones as guanidine bioisosteres: application to a new class of potent, selective and orally bioavailable, non-amide-based small-molecule thrombin inhibitors. Bioorg Med Chem Lett10:1-4 (2000) Prothrombin
Name:Prothrombin
Type:Protein
Mol. Mass.:70029.57
Organism:Homo sapiens (Human)
Description:P00734
Residue:622
BDBM50083966
NameBDBM50083966
Synonyms:3-[((3E)-3-{[(E)-amino(imino)methyl]hydrazono}propyl)oxy]-5-methylphenyl 5-chlorothiophene-2-sulfonate | CHEMBL129294
TypeSmall organic molecule
Emp. Form.C15H17ClN4O4S2
Mol. Mass.416.903
SMILESCc1cc(OCCC=NNC(N)=N)cc(OS(=O)(=O)c2ccc(Cl)s2)c1