Reaction Details
TargetProthrombin
LigandBDBM50083971
Substrate/Competitorn/a
Meas. Tech.ChEBML_208342
Ki 6±n/a nM
Citation Soll, RMLu, TTomczuk, BIllig, CRFedde, CEisennagel, SBone, RMurphy, LSpurlino, JSalemme, FR Amidinohydrazones as guanidine bioisosteres: application to a new class of potent, selective and orally bioavailable, non-amide-based small-molecule thrombin inhibitors. Bioorg Med Chem Lett10:1-4 (2000) Prothrombin
Name:Prothrombin
Type:Protein
Mol. Mass.:70029.57
Organism:Homo sapiens (Human)
Description:P00734
Residue:622
BDBM50083971
NameBDBM50083971
Synonyms:3-[((3E)-3-{[(E)-amino(imino)methyl]hydrazono}propyl)oxy]-5-methylphenyl 3-methylbenzenesulfonate | CHEMBL341126
TypeSmall organic molecule
Emp. Form.C18H22N4O4S
Mol. Mass.390.457
SMILESCc1cccc(c1)S(=O)(=O)Oc1cc(C)cc(OCCC=NNC(N)=N)c1