Reaction Details
TargetProtein kinase C delta type
LigandBDBM50084058
Substrate/Competitorn/a
Meas. Tech.ChEBML_152996
Ki 0.800000±n/a nM
Citation Endo, YYokoyama, A Role of the hydrophobic moiety of tumor promoters. Synthesis and activity of 2-alkylated benzolactams. Bioorg Med Chem Lett10:63-6 (2000) Protein kinase C delta type
Name:Protein kinase C delta type
Type:Enzyme
Mol. Mass.:77516.79
Organism:Homo sapiens (Human)
Description:The recombinant human PKC enzymes were produced using a baculovirus expression system in SF9 cells
Residue:676
BDBM50084058
NameBDBM50084058
Synonyms:(2S,5S)-2-Decyl-5-hydroxymethyl-1-methyl-1,4,5,6-tetrahydro-2H-benzo[e][1,4]diazocin-3-one | CHEMBL159233
TypeSmall organic molecule
Emp. Form.C22H36N2O2
Mol. Mass.360.5334
SMILESCCCCCCCCCC[C@@H]1N(C)c2ccccc2C[C@@H](CO)NC1=O