Reaction Details
TargetReverse transcriptase/RNaseH
LigandBDBM50084093
Substrate/Competitorn/a
Meas. Tech.ChEBML_195059
IC50 1000±n/a nM
Citation Dong, YVenkatachalam, TKNarla, RKTrieu, VNSudbeck, EAUckun, FM Antioxidant function of phenethyl-5-bromo-pyridyl thiourea compounds with potent anti-HIV activity. Bioorg Med Chem Lett10:87-90 (2000) Reverse transcriptase/RNaseH
Name:Reverse transcriptase/RNaseH
Type:PROTEIN
Mol. Mass.:65229.15
Organism:Human immunodeficiency virus 1
Description:ChEMBL_1473730
Residue:566
BDBM50084093
NameBDBM50084093
Synonyms:1-(5-Bromo-pyridin-2-yl)-3-[2-(2-methoxy-phenyl)-ethyl]-thiourea | CHEMBL355333
TypeSmall organic molecule
Emp. Form.C15H16BrN3OS
Mol. Mass.366.276
SMILESCOc1ccccc1CCNC(=S)Nc1ccc(Br)cn1