Reaction Details
TargetCoagulation factor X
LigandBDBM17284
Substrate/Competitorn/a
Meas. Tech.ChEMBL_49303 (CHEMBL661584)
Ki 0.11±n/a nM
Citation Guilford, WJShaw, KJDallas, JLKoovakkat, SLee, WLiang, ALight, DRMcCarrick, MAWhitlow, MYe, BMorrissey, MM Synthesis, characterization, and structure-activity relationships of amidine-substituted (bis)benzylidene-cycloketone olefin isomers as potent and selective factor Xa inhibitors. J Med Chem42:5415-25 (2000) Coagulation factor X
Name:Coagulation factor X
Type:Enzyme
Mol. Mass.:54726.60
Organism:Homo sapiens (Human)
Description:n/a
Residue:488
BDBM17284
NameBDBM17284
Synonyms:2-{[2-(5-carbamimidoyl-2-hydroxyphenoxy)-3,5-difluoro-6-[3-(1-methyl-4,5-dihydro-1H-imidazol-2-yl)phenoxy]pyridin-4-yl](methyl)amino}acetic acid CI-1031 | ZK-807834
TypeSmall organic molecule
Emp. Form.C25H24F2N6O5
Mol. Mass.526.4921
SMILESCN(CC(O)=O)c1c(F)c(Oc2cccc(c2)C2=NCCN2C)nc(Oc2cc(ccc2O)C(N)=N)c1F