Reaction Details
TargetCarbonic anhydrase 4
LigandBDBM50084563
Substrate/Competitorn/a
Meas. Tech.ChEMBL_45422 (CHEMBL658749)
Ki 0.8±n/a nM
Citation Scozzafava, ABriganti, FIlies, MASupuran, CT Carbonic anhydrase inhibitors: synthesis of membrane-impermeant low molecular weight sulfonamides possessing in vivo selectivity for the membrane-bound versus cytosolic isozymes. J Med Chem43:292-300 (2000) Carbonic anhydrase 4
Name:Carbonic anhydrase 4
Type:Enzyme
Mol. Mass.:35152.74
Organism:Bos taurus (bovine)
Description:Bovine isozyme, isolated from lung microsomes
Residue:312
BDBM50084563
NameBDBM50084563
Synonyms:5-(4-Amino-benzenesulfonylimino)-4-methyl-4,5-dihydro-[1,3,4]thiadiazole-2-sulfonic acid amide 5-[4-Amino-benzenesulfonylimino]-4-methyl-4,5-dihydro-[1,3,4]thiadiazole-2-sulfonic acid amide | CHEMBL13630
TypeSmall organic molecule
Emp. Form.C9H11N5O4S3
Mol. Mass.349.41
SMILESCn1nc(s\c1=N\S(=O)(=O)c1ccc(N)cc1)S(N)(=O)=O