Reaction Details
TargetCysteinyl leukotriene receptor 1
LigandBDBM50084814
Substrate/Competitorn/a
Meas. Tech.ChEMBL_52222 (CHEMBL663972)
Ki 1.5±n/a nM
Citation Palomer, APascual, JCabré, FGarcía, MLMauleón, D Derivation of pharmacophore and CoMFA models for leukotriene D(4) receptor antagonists of the quinolinyl(bridged)aryl series. J Med Chem43:392-400 (2000) Cysteinyl leukotriene receptor 1
Name:Cysteinyl leukotriene receptor 1
Type:Enzyme Catalytic Domain
Mol. Mass.:39007.58
Organism:GUINEA PIG
Description:Leukotriene D4 0 GUINEA PIG::Q2NNR5
Residue:340
BDBM50084814
NameBDBM50084814
Synonyms:4-(4-(7-(quinolin-2-ylmethoxy)-2-naphthamido)phenyl)butanoic acid CHEMBL131611
TypeSmall organic molecule
Emp. Form.C31H26N2O4
Mol. Mass.490.5491
SMILESOC(=O)CCCc1ccc(NC(=O)c2ccc3ccc(OCc4ccc5ccccc5n4)cc3c2)cc1