Reaction Details
TargetRetinoic acid receptor gamma
LigandBDBM50084832
Substrate/Competitorn/a
Meas. Tech.ChEMBL_196000 (CHEMBL800489)
IC50 2±n/a nM
Citation Kikuchi, KHibi, SYoshimura, HTokuhara, NTai, KHida, TYamauchi, TNagai, M Syntheses and structure-activity relationships of 5,6,7, 8-tetrahydro-5,5,8,8-tetramethyl-2-quinoxaline derivatives with retinoic acid receptor alpha agonistic activity. J Med Chem43:409-19 (2000) Retinoic acid receptor gamma
Name:Retinoic acid receptor gamma
Type:PROTEIN
Mol. Mass.:50345.43
Organism:Homo sapiens (Human)
Description:ChEMBL_1458016
Residue:454
BDBM50084832
NameBDBM50084832
Synonyms:4-[5-(5,5,8,8-Tetramethyl-5,6,7,8-tetrahydro-quinoxalin-2-yl)-thiophen-3-yl]-benzoic acid | CHEMBL131850
TypeSmall organic molecule
Emp. Form.C23H24N2O2S
Mol. Mass.392.514
SMILESCC1(C)CCC(C)(C)c2nc(cnc12)-c1cc(cs1)-c1ccc(cc1)C(O)=O