Reaction Details
TargetRetinoic acid receptor beta
LigandBDBM50084835
Substrate/Competitorn/a
Meas. Tech.ChEMBL_195487 (CHEMBL798909)
IC50 230±n/a nM
Citation Kikuchi, KHibi, SYoshimura, HTokuhara, NTai, KHida, TYamauchi, TNagai, M Syntheses and structure-activity relationships of 5,6,7, 8-tetrahydro-5,5,8,8-tetramethyl-2-quinoxaline derivatives with retinoic acid receptor alpha agonistic activity. J Med Chem43:409-19 (2000) Retinoic acid receptor beta
Name:Retinoic acid receptor beta
Type:PROTEIN
Mol. Mass.:50498.70
Organism:Homo sapiens (Human)
Description:ChEMBL_1458015
Residue:455
BDBM50084835
NameBDBM50084835
Synonyms:4-[5-(5,5,8,8-Tetramethyl-5,6,7,8-tetrahydro-quinoxalin-2-yl)-1H-pyrrol-2-yl]-benzoic acid | CHEMBL133725
TypeSmall organic molecule
Emp. Form.C23H25N3O2
Mol. Mass.375.4635
SMILESCC1(C)CCC(C)(C)c2nc(cnc12)-c1ccc([nH]1)-c1ccc(cc1)C(O)=O