Reaction Details
TargetRetinoic acid receptor alpha
LigandBDBM50084833
Substrate/Competitorn/a
Meas. Tech.ChEMBL_197400 (CHEMBL799791)
IC50 0.45±n/a nM
Citation Kikuchi, KHibi, SYoshimura, HTokuhara, NTai, KHida, TYamauchi, TNagai, M Syntheses and structure-activity relationships of 5,6,7, 8-tetrahydro-5,5,8,8-tetramethyl-2-quinoxaline derivatives with retinoic acid receptor alpha agonistic activity. J Med Chem43:409-19 (2000) Retinoic acid receptor alpha
Name:Retinoic acid receptor alpha
Type:PROTEIN
Mol. Mass.:50778.87
Organism:Homo sapiens (Human)
Description:ChEMBL_1466191
Residue:462
BDBM50084833
NameBDBM50084833
Synonyms:4-[5-(5,5,8,8-Tetramethyl-5,6,7,8-tetrahydro-naphthalen-2-yl)-1H-pyrrol-2-yl]-benzoic acid | CHEMBL134375
TypeSmall organic molecule
Emp. Form.C25H27NO2
Mol. Mass.373.4874
SMILESCC1(C)CCC(C)(C)c2cc(ccc12)-c1ccc([nH]1)-c1ccc(cc1)C(O)=O