Reaction Details
TargetMu-type opioid receptor
LigandBDBM50451122
Substrate/Competitorn/a
Meas. Tech.ChEBML_149311
IC50 8240±n/a nM
Citation Pagé, DMcClory, AMischki, TSchmidt, RButterworth, JSt-Onge, SLabarre, MPayza, KBrown, W Novel Dmt-Tic dipeptide analogues as selective delta-opioid receptor antagonists. Bioorg Med Chem Lett10:167-70 (2000) Mu-type opioid receptor
Name:Mu-type opioid receptor
Type:G Protein-Coupled Receptor (GPCR)
Mol. Mass.:44789.51
Organism:Homo sapiens (Human)
Description:P35372
Residue:400
BDBM50451122
NameBDBM50451122
Synonyms:CHEMBL2115430
TypeSmall organic molecule
Emp. Form.C22H24Br2N2O5
Mol. Mass.556.244
SMILESCOc1c(Br)cc2C[C@H](N(Cc2c1Br)C(=O)[C@H](N)Cc1c(C)cc(O)cc1C)C(O)=O