Reaction Details
TargetDelta-type opioid receptor
LigandBDBM50084989
Substrate/Competitorn/a
Meas. Tech.ChEBML_147330
IC50 14±n/a nM
Citation Pagé, DMcClory, AMischki, TSchmidt, RButterworth, JSt-Onge, SLabarre, MPayza, KBrown, W Novel Dmt-Tic dipeptide analogues as selective delta-opioid receptor antagonists. Bioorg Med Chem Lett10:167-70 (2000) Delta-type opioid receptor
Name:Delta-type opioid receptor
Type:G Protein-Coupled Receptor (GPCR)
Mol. Mass.:40382.98
Organism:Homo sapiens (Human)
Description:Competition binding assays were carried out using membrane preparations from transfected HN9.10 cells that constitutively expressed the delta opioid receptor.
Residue:372
BDBM50084989
NameBDBM50084989
Synonyms:(S)-2-[2-Amino-3-(4-hydroxy-2,6-dimethyl-phenyl)-propionyl]-7-thiophen-3-yl-1,2,3,4-tetrahydro-isoquinoline-3-carboxylic acid | CHEMBL418080
TypeSmall organic molecule
Emp. Form.C25H26N2O4S
Mol. Mass.450.55
SMILESCc1cc(O)cc(C)c1CC(N)C(=O)N1Cc2cc(ccc2C[C@H]1C(O)=O)-c1ccsc1