Reaction Details
TargetMu-type opioid receptor
LigandBDBM50451126
Substrate/Competitorn/a
Meas. Tech.ChEBML_149311
IC50 1140±n/a nM
Citation Pagé, DMcClory, AMischki, TSchmidt, RButterworth, JSt-Onge, SLabarre, MPayza, KBrown, W Novel Dmt-Tic dipeptide analogues as selective delta-opioid receptor antagonists. Bioorg Med Chem Lett10:167-70 (2000) Mu-type opioid receptor
Name:Mu-type opioid receptor
Type:G Protein-Coupled Receptor (GPCR)
Mol. Mass.:44789.51
Organism:Homo sapiens (Human)
Description:P35372
Residue:400
BDBM50451126
NameBDBM50451126
Synonyms:CHEMBL2114977
TypeSmall organic molecule
Emp. Form.C28H30N2O5
Mol. Mass.474.5482
SMILESCOc1ccc(cc1)-c1ccc2C[C@H](N(Cc2c1)C(=O)[C@@H](N)Cc1c(C)cc(O)cc1C)C(O)=O