Reaction Details
TargetKappa-type opioid receptor
LigandBDBM50084995
Substrate/Competitorn/a
Meas. Tech.ChEBML_145849
IC50 9290±n/a nM
Citation Pagé, DMcClory, AMischki, TSchmidt, RButterworth, JSt-Onge, SLabarre, MPayza, KBrown, W Novel Dmt-Tic dipeptide analogues as selective delta-opioid receptor antagonists. Bioorg Med Chem Lett10:167-70 (2000) Kappa-type opioid receptor
Name:Kappa-type opioid receptor
Type:G Protein-Coupled Receptor (GPCR)
Mol. Mass.:42648.76
Organism:Homo sapiens (Human)
Description:P41145
Residue:380
BDBM50084995
NameBDBM50084995
Synonyms:(S)-2-[2-Amino-3-(4-hydroxy-2,6-dimethyl-phenyl)-propionyl]-7-hydroxy-1,2,3,4-tetrahydro-isoquinoline-3-carboxylic acid | CHEMBL44732
TypeSmall organic molecule
Emp. Form.C21H24N2O5
Mol. Mass.384.4257
SMILESCc1cc(O)cc(C)c1CC(N)C(=O)N1Cc2cc(O)ccc2C[C@H]1C(O)=O