Reaction Details
TargetKappa-type opioid receptor
LigandBDBM50084993
Substrate/Competitorn/a
Meas. Tech.ChEBML_145849
IC50>10000±n/a nM
Citation Pagé, DMcClory, AMischki, TSchmidt, RButterworth, JSt-Onge, SLabarre, MPayza, KBrown, W Novel Dmt-Tic dipeptide analogues as selective delta-opioid receptor antagonists. Bioorg Med Chem Lett10:167-70 (2000) Kappa-type opioid receptor
Name:Kappa-type opioid receptor
Type:G Protein-Coupled Receptor (GPCR)
Mol. Mass.:42648.76
Organism:Homo sapiens (Human)
Description:P41145
Residue:380
BDBM50084993
NameBDBM50084993
Synonyms:(S)-2-[2-Amino-3-(4-hydroxy-2,6-dimethyl-phenyl)-propionyl]-7-benzofuran-2-yl-1,2,3,4-tetrahydro-isoquinoline-3-carboxylic acid | CHEMBL46160
TypeSmall organic molecule
Emp. Form.C29H28N2O5
Mol. Mass.484.543
SMILESCc1cc(O)cc(C)c1CC(N)C(=O)N1Cc2cc(ccc2C[C@H]1C(O)=O)-c1cc2ccccc2o1