Reaction Details
TargetMu-type opioid receptor
LigandBDBM50084994
Substrate/Competitorn/a
Meas. Tech.ChEBML_149311
IC50>10000±n/a nM
Citation Pagé, DMcClory, AMischki, TSchmidt, RButterworth, JSt-Onge, SLabarre, MPayza, KBrown, W Novel Dmt-Tic dipeptide analogues as selective delta-opioid receptor antagonists. Bioorg Med Chem Lett10:167-70 (2000) Mu-type opioid receptor
Name:Mu-type opioid receptor
Type:G Protein-Coupled Receptor (GPCR)
Mol. Mass.:44789.51
Organism:Homo sapiens (Human)
Description:P35372
Residue:400
BDBM50084994
NameBDBM50084994
Synonyms:(S)-2-[2-Amino-3-(4-hydroxy-2,6-dimethyl-phenyl)-propionyl]-7-methoxy-6-phenyl-1,2,3,4-tetrahydro-isoquinoline-3-carboxylic acid | CHEMBL430777
TypeSmall organic molecule
Emp. Form.C28H30N2O5
Mol. Mass.474.5482
SMILESCOc1cc2CN([C@@H](Cc2cc1-c1ccccc1)C(O)=O)C(=O)C(N)Cc1c(C)cc(O)cc1C