Reaction Details
TargetAlpha-1A adrenergic receptor
LigandBDBM50084999
Substrate/Competitorn/a
Meas. Tech.ChEBML_33727
Ki 0.600000±n/a nM
Citation Lagu, BTian, DChiu, GNagarathnam, DFang, JShen, QForray, CRansom, RWChang, RSVyas, KPZhang, KGluchowski, C Synthesis and evaluation of furo[3,4-d]pyrimidinones as selective alpha1a-adrenergic receptor antagonists. Bioorg Med Chem Lett10:175-8 (2000) Alpha-1A adrenergic receptor
Name:Alpha-1A adrenergic receptor
Type:Cell-surface receptors
Mol. Mass.:51511.67
Organism:Homo sapiens (Human)
Description:P35348
Residue:466
BDBM50084999
NameBDBM50084999
Synonyms:4-(3,4-Difluoro-phenyl)-2,5-dioxo-1,2,5,7-tetrahydro-4H-furo[3,4-d]pyrimidine-3-carboxylic acid {3-[4-(2-nitro-phenyl)-piperazin-1-yl]-propyl}-amide | CHEMBL51871
TypeSmall organic molecule
Emp. Form.C26H26F2N6O6
Mol. Mass.556.518
SMILES[O-][N+](=O)c1ccccc1N1CCN(CCCNC(=O)N2C(C3=C(COC3=O)NC2=O)c2ccc(F)c(F)c2)CC1