Reaction Details
TargetPeroxisome proliferator-activated receptor delta
LigandBDBM28701
Substrate/Competitorn/a
Meas. Tech.ChEMBL_88431 (CHEMBL879147)
EC50 20000±n/a nM
Citation Willson, TMBrown, PJSternbach, DDHenke, BR The PPARs: from orphan receptors to drug discovery. J Med Chem43:527-50 (2000) Peroxisome proliferator-activated receptor delta
Name:Peroxisome proliferator-activated receptor delta
Type:Enzyme
Mol. Mass.:49910.45
Organism:Homo sapiens (Human)
Description:Q03181
Residue:441
BDBM28701
NameBDBM28701
Synonyms:2-(4-{2-[(4-chlorophenyl)formamido]ethyl}phenoxy)-2-methylpropanoic acid Bezafibrate Cedur | Sklerofibrat
TypeSmall organic molecule
Emp. Form.C19H20ClNO4
Mol. Mass.361.819
SMILESCC(C)(Oc1ccc(CCNC(=O)c2ccc(Cl)cc2)cc1)C(O)=O