Reaction Details
TargetPeroxisome proliferator-activated receptor gamma
LigandBDBM50083625
Substrate/Competitorn/a
Meas. Tech.ChEMBL_139152 (CHEMBL747685)
EC50 140±n/a nM
Citation Willson, TMBrown, PJSternbach, DDHenke, BR The PPARs: from orphan receptors to drug discovery. J Med Chem43:527-50 (2000) Peroxisome proliferator-activated receptor gamma
Name:Peroxisome proliferator-activated receptor gamma
Type:PROTEIN
Mol. Mass.:57593.55
Organism:Mus musculus
Description:ChEMBL_1453700
Residue:505
BDBM50083625
NameBDBM50083625
Synonyms:CHEMBL320553 {3-[2-(4-Methoxy-phenyl)-ethyl]-2-phenyl-1H-indol-5-yl}-acetic acid(GW 0207)
TypeSmall organic molecule
Emp. Form.C25H23NO3
Mol. Mass.385.455
SMILESCOc1ccc(CCc2c([nH]c3ccc(CC(O)=O)cc23)-c2ccccc2)cc1