Reaction Details
TargetPeroxisome proliferator-activated receptor gamma
LigandBDBM50085043
Substrate/Competitorn/a
Meas. Tech.ChEMBL_139152 (CHEMBL747685)
EC50 100±n/a nM
Citation Willson, TMBrown, PJSternbach, DDHenke, BR The PPARs: from orphan receptors to drug discovery. J Med Chem43:527-50 (2000) Peroxisome proliferator-activated receptor gamma
Name:Peroxisome proliferator-activated receptor gamma
Type:PROTEIN
Mol. Mass.:57593.55
Organism:Mus musculus
Description:ChEMBL_1453700
Residue:505
BDBM50085043
NameBDBM50085043
Synonyms:3-{4-[2-(Benzooxazol-2-yl-methyl-amino)-ethoxy]-phenyl}-2-ethoxy-propionic acid CHEMBL306229 | SB-213068
TypeSmall organic molecule
Emp. Form.C21H24N2O5
Mol. Mass.384.4257
SMILESCCOC(Cc1ccc(OCCN(C)c2nc3ccccc3o2)cc1)C(O)=O