Reaction Details
TargetSerine protease 1
LigandBDBM50085384
Substrate/Competitorn/a
Meas. Tech.ChEBML_213076
Ki>2900±n/a nM
Citation Gong, YPauls, HWSpada, APCzekaj, MLiang, GChu, VColussi, DJBrown, KDGao, J Amido-(propyl and allyl)-hydroxybenzamidines: development of achiral inhibitors of factor Xa. Bioorg Med Chem Lett10:217-21 (2000) Serine protease 1
Name:Serine protease 1
Type:Enzyme
Mol. Mass.:26557.80
Organism:Homo sapiens (Human)
Description:P07477
Residue:247
BDBM50085384
NameBDBM50085384
Synonyms:Biphenyl-4-carboxylic acid [3-(5-carbamimidoyl-2-hydroxy-phenyl)-propyl]-amide | CHEMBL70400
TypeSmall organic molecule
Emp. Form.C23H23N3O2
Mol. Mass.373.4476
SMILESNC(=N)c1ccc(O)c(CCCNC(=O)c2ccc(cc2)-c2ccccc2)c1