Reaction Details
TargetProthrombin
LigandBDBM50085395
Substrate/Competitorn/a
Meas. Tech.ChEBML_48309
Ki>4000±n/a nM
Citation Gong, YPauls, HWSpada, APCzekaj, MLiang, GChu, VColussi, DJBrown, KDGao, J Amido-(propyl and allyl)-hydroxybenzamidines: development of achiral inhibitors of factor Xa. Bioorg Med Chem Lett10:217-21 (2000) Prothrombin
Name:Prothrombin
Type:Protein
Mol. Mass.:70029.57
Organism:Homo sapiens (Human)
Description:P00734
Residue:622
BDBM50085395
NameBDBM50085395
Synonyms:4-tert-Butyl-N-[3-(5-carbamimidoyl-2-hydroxy-phenyl)-propyl]-benzamide | CHEMBL70741
TypeSmall organic molecule
Emp. Form.C21H27N3O2
Mol. Mass.353.458
SMILESCC(C)(C)c1ccc(cc1)C(=O)NCCCc1cc(ccc1O)C(N)=N