Reaction Details
TargetProthrombin
LigandBDBM50085392
Substrate/Competitorn/a
Meas. Tech.ChEBML_48309
Ki>4000±n/a nM
Citation Gong, YPauls, HWSpada, APCzekaj, MLiang, GChu, VColussi, DJBrown, KDGao, J Amido-(propyl and allyl)-hydroxybenzamidines: development of achiral inhibitors of factor Xa. Bioorg Med Chem Lett10:217-21 (2000) Prothrombin
Name:Prothrombin
Type:Protein
Mol. Mass.:70029.57
Organism:Homo sapiens (Human)
Description:P00734
Residue:622
BDBM50085392
NameBDBM50085392
Synonyms:Biphenyl-3,4'-dicarboxylic acid 3-amide 4'-{[3-(5-carbamimidoyl-2-hydroxy-phenyl)-propyl]-amide} | CHEMBL70328
TypeSmall organic molecule
Emp. Form.C24H24N4O3
Mol. Mass.416.4724
SMILESNC(=N)c1ccc(O)c(CCCNC(=O)c2ccc(cc2)-c2cccc(c2)C(N)=O)c1