Reaction Details
TargetCoagulation factor X
LigandBDBM50085397
Substrate/Competitorn/a
Meas. Tech.ChEBML_48998
Ki 254±n/a nM
Citation Gong, YPauls, HWSpada, APCzekaj, MLiang, GChu, VColussi, DJBrown, KDGao, J Amido-(propyl and allyl)-hydroxybenzamidines: development of achiral inhibitors of factor Xa. Bioorg Med Chem Lett10:217-21 (2000) Coagulation factor X
Name:Coagulation factor X
Type:Enzyme
Mol. Mass.:54726.60
Organism:Homo sapiens (Human)
Description:n/a
Residue:488
BDBM50085397
NameBDBM50085397
Synonyms:CHEMBL303211 | N-[3-(5-Carbamimidoyl-2-hydroxy-phenyl)-propyl]-4-(3H-imidazol-4-yl)-benzamide
TypeSmall organic molecule
Emp. Form.C20H21N5O2
Mol. Mass.363.413
SMILESNC(=N)c1ccc(O)c(CCCNC(=O)c2ccc(cc2)-c2c[nH]cn2)c1