Reaction Details
TargetProthrombin
LigandBDBM50085401
Substrate/Competitorn/a
Meas. Tech.ChEBML_48309
Ki>4000±n/a nM
Citation Gong, YPauls, HWSpada, APCzekaj, MLiang, GChu, VColussi, DJBrown, KDGao, J Amido-(propyl and allyl)-hydroxybenzamidines: development of achiral inhibitors of factor Xa. Bioorg Med Chem Lett10:217-21 (2000) Prothrombin
Name:Prothrombin
Type:Protein
Mol. Mass.:70029.57
Organism:Homo sapiens (Human)
Description:P00734
Residue:622
BDBM50085401
NameBDBM50085401
Synonyms:CHEMBL421676 | N-[(E)-3-(5-Carbamimidoyl-2-hydroxy-phenyl)-allyl]-4-(3H-imidazol-4-yl)-benzamide
TypeSmall organic molecule
Emp. Form.C20H19N5O2
Mol. Mass.361.3972
SMILESNC(=N)c1ccc(O)c(C=CCNC(=O)c2ccc(cc2)-c2c[nH]cn2)c1