Reaction Details
TargetProthrombin
LigandBDBM50085404
Substrate/Competitorn/a
Meas. Tech.ChEBML_48309
Ki>4000±n/a nM
Citation Gong, YPauls, HWSpada, APCzekaj, MLiang, GChu, VColussi, DJBrown, KDGao, J Amido-(propyl and allyl)-hydroxybenzamidines: development of achiral inhibitors of factor Xa. Bioorg Med Chem Lett10:217-21 (2000) Prothrombin
Name:Prothrombin
Type:Protein
Mol. Mass.:70029.57
Organism:Homo sapiens (Human)
Description:P00734
Residue:622
BDBM50085404
NameBDBM50085404
Synonyms:5-Pyridin-2-yl-thiophene-2-carboxylic acid [3-(5-carbamimidoyl-2-hydroxy-phenyl)-propyl]-amide | CHEMBL68101
TypeSmall organic molecule
Emp. Form.C20H20N4O2S
Mol. Mass.380.463
SMILESNC(=N)c1ccc(O)c(CCCNC(=O)c2ccc(s2)-c2ccccn2)c1