Reaction Details
TargetNeprilysin
LigandBDBM50085457
Substrate/Competitorn/a
Meas. Tech.ChEBML_144612
IC50 18±n/a nM
Citation Robl, JASimpkins, LMAsaad, MM N-formyl hydroxylamine containing dipeptides: generation of a new class of vasopeptidase inhibitors. Bioorg Med Chem Lett10:257-60 (2000) Neprilysin
Name:Neprilysin
Type:Protein
Mol. Mass.:85789.59
Organism:Rattus norvegicus (Rat)
Description:P07861
Residue:750
BDBM50085457
NameBDBM50085457
Synonyms:CHEMBL89533 | {(S)-6-[(R)-2-Benzyl-3-(formyl-hydroxy-amino)-propionylamino]-2,2-dimethyl-7-oxo-azepan-1-yl}-acetic acid
TypeSmall organic molecule
Emp. Form.C21H29N3O6
Mol. Mass.419.4715
SMILESCC1(C)CCC[C@H](NC(=O)[C@@H](CN(O)C=O)Cc2ccccc2)C(=O)N1CC(O)=O