Reaction Details
Target2-5A-dependent ribonuclease
LigandBDBM50085553
Substrate/Competitorn/a
Meas. Tech.ChEMBL_195095 (CHEMBL795208)
EC50 0.240000±n/a nM
Citation Kitade, YWakana, MTsuboi, TYatome, CBayly, SFPlayer, MRTorrence, PF 2-Methyladenosine-Substituted 2',5'-oligoadenylates: conformations, 2-5A binding and catalytic activities with human ribonuclease L. Bioorg Med Chem Lett10:329-31 (2000) 2-5A-dependent ribonuclease
Name:2-5A-dependent ribonuclease
Type:PROTEIN
Mol. Mass.:83534.35
Organism:Homo sapiens (Human)
Description:ChEMBL_164152
Residue:741
BDBM50085553
NameBDBM50085553
Synonyms:CHEMBL214603 | Oligoadenylate analogue
TypeSmall organic molecule
Emp. Form.C31H42N15O25P5
Mol. Mass.1179.6195
SMILESCc1nc(N)c2ncn([C@@H]3O[C@H](COP(O)(=O)O[C@@H]4[C@H](O)[C@@H](COP(O)(=O)O[C@@H]5[C@H](O)[C@@H](COP(O)(=O)OP(O)(=O)OP(O)(O)=O)O[C@H]5n5cnc6c(N)ncnc56)O[C@H]4n4cnc5c(N)ncnc45)[C@@H](O)[C@H]3O)c2n1