Reaction Details
TargetIntegrin alpha-IIb/beta-3
LigandBDBM50085605
Substrate/Competitorn/a
Meas. Tech.ChEMBL_70309 (CHEMBL677856)
IC50 3±n/a nM
Citation Fisher, MJGiese, UHarms, CSKinnick, MDLindstrom, TDMcCowan, JRMest, HJMorin, JMMullaney, JTPaal, MRapp, ARühter, GRuterbories, KJSall, DJScarborough, RMSchotten, TStenzel, WTowner, RDUm, SLUtterback, BGWyss, VLJakubowski, JA Fused bicyclic Gly-Asp beta-turn mimics with potent affinity for GPIIb-IIIa. Exploration of the arginine isostere. Bioorg Med Chem Lett10:385-9 (2000) Integrin alpha-IIb/beta-3
Name:Integrin alpha-IIb/beta-3
Synonyms:Glycoprotein IIb/IIIa
Type:n/a
Mol. Mass.:n/a
Description:ASSAY_ID of EBI is 30109
Components:This complex has 2 components.
Component 1
Name:Integrin beta-3
Type:Protein
Mol. Mass.:87038.91
Organism:Homo sapiens (Human)
Description:P05106
Residue:788
Component 2
Name:Integrin alpha-IIb
Synonyms:CD_antigen=CD41 GPIIb Glycoprotein IIb ITGA2B Integrin alpha-IIb heavy chain Integrin alpha-IIb light chain, form 2 Integrin alpha-V/beta-3 and alpha-IIb/beta 3 | Platelet membrane glycoprotein IIb
Type:Protein
Mol. Mass.:113354.85
Organism:Homo sapiens (Human)
Description:P08514
Residue:1039
BDBM50085605
NameBDBM50085605
Synonyms:CHEMBL126411 | [6-(4-Carbamimidoyl-2-fluoro-benzoylamino)-1-oxo-1,2,3,4-tetrahydro-naphthalen-2-yl]-acetic acid
TypeSmall organic molecule
Emp. Form.C20H18FN3O4
Mol. Mass.383.373
SMILESNC(=N)c1ccc(C(=O)Nc2ccc3C(=O)C(CC(O)=O)CCc3c2)c(F)c1