Reaction Details
TargetThymidylate synthase
LigandBDBM50085615
Substrate/Competitorn/a
Meas. Tech.ChEBML_217695
Ki 15±n/a nM
Citation Kalman, TINie, ZKamat, A Mechanism-based inactivation of thymidylate synthase by 5-(3-fluoropropyn-1-yl)-2'-deoxyuridine 5'-phosphate. Bioorg Med Chem Lett10:391-4 (2000) Thymidylate synthase
Name:Thymidylate synthase
Type:Enzyme
Mol. Mass.:36576.54
Organism:Lactobacillus casei
Description:n/a
Residue:316
BDBM50085615
NameBDBM50085615
Synonyms:CHEMBL3143067 | Phosphoric acid mono-{5-[5-(3-fluoro-prop-1-ynyl)-2,4-dioxo-3,4-dihydro-2H-pyrimidin-1-yl]-3-hydroxy-tetrahydro-furan-2-ylmethyl} ester
TypeSmall organic molecule
Emp. Form.C12H14FN2O8P
Mol. Mass.364.2203
SMILESO[C@H]1C[C@@H](O[C@@H]1COP(O)(O)=O)n1cc(C#CCF)c(=O)[nH]c1=O