Reaction Details
TargetProstaglandin G/H synthase 2
LigandBDBM13063
Substrate/Competitorn/a
Meas. Tech.ChEMBL_159743 (CHEMBL762907)
IC50 5±n/a nM
Citation Talley, JJBrown, DLCarter, JSGraneto, MJKoboldt, CMMasferrer, JLPerkins, WERogers, RSShaffer, AFZhang, YYZweifel, BSSeibert, K 4-[5-Methyl-3-phenylisoxazol-4-yl]- benzenesulfonamide, valdecoxib: a potent and selective inhibitor of COX-2. J Med Chem43:775-7 (2000) Prostaglandin G/H synthase 2
Name:Prostaglandin G/H synthase 2
Type:Enzyme
Mol. Mass.:69003.89
Organism:Homo sapiens (Human)
Description:Recombinant Cox-2 provided by Cayman (Cayman Chemical Co.,Ann Arbor, MI).
Residue:604
BDBM13063
NameBDBM13063
Synonyms:4-(5-methyl-3-phenyl-1,2-oxazol-4-yl)benzene-1-sulfonamide CHEMBL865 Valdecoxib | cid_119607
TypeSmall organic molecule
Emp. Form.C16H14N2O3S
Mol. Mass.314.359
SMILESCc1onc(c1-c1ccc(cc1)S(N)(=O)=O)-c1ccccc1