Reaction Details
TargetGonadotropin-releasing hormone receptor
LigandBDBM50085713
Substrate/Competitorn/a
Meas. Tech.ChEMBL_71750 (CHEMBL680272)
Ki 1.8±n/a nM
Citation Rivier, JEStruthers, RSPorter, JLahrichi, SLJiang, GCervini, LAIbea, MKirby, DAKoerber, SCRivier, CL Design of potent dicyclic (4-10/5-8) gonadotropin releasing hormone (GnRH) antagonists. J Med Chem43:784-96 (2000) Gonadotropin-releasing hormone receptor
Name:Gonadotropin-releasing hormone receptor
Type:PROTEIN
Mol. Mass.:37767.60
Organism:Rattus norvegicus
Description:ChEMBL_1335047
Residue:327
BDBM50085713
NameBDBM50085713
Synonyms:CHEMBL262160 Cyclo (5,5'-8) [Ac-D Nal, Cpa, D Pal, Asp, Glu(beta Ala), D Arg, Leu, (L or D) AgI, Pro, D Ala]GnRH
TypeSmall organic molecule
Emp. Form.C60H86ClN17O16
Mol. Mass.1336.882
SMILESCC[C@H](NC(C)=O)C(=O)N[C@@H](Cc1ccc(Cl)cc1)C(=O)N[C@@H](Cc1cccnc1)C(=O)N[C@@H](CC(O)=O)C(=O)N[C@@H]1CCC(=O)NCCC(=O)NC(=O)CC[C@H](NC(=O)[C@H](CC(C)C)NC(=O)[C@@H](CCCNC(N)=N)NC1=O)C(=O)N1CCC[C@@H]1C(=O)N[C@@H](C)C(N)=O