Reaction Details
TargetGonadotropin-releasing hormone receptor
LigandBDBM50085734
Substrate/Competitorn/a
Meas. Tech.ChEMBL_71750 (CHEMBL680272)
Ki 0.1±n/a nM
Citation Rivier, JEStruthers, RSPorter, JLahrichi, SLJiang, GCervini, LAIbea, MKirby, DAKoerber, SCRivier, CL Design of potent dicyclic (4-10/5-8) gonadotropin releasing hormone (GnRH) antagonists. J Med Chem43:784-96 (2000) Gonadotropin-releasing hormone receptor
Name:Gonadotropin-releasing hormone receptor
Type:PROTEIN
Mol. Mass.:37767.60
Organism:Rattus norvegicus
Description:ChEMBL_1335047
Residue:327
BDBM50085734
NameBDBM50085734
Synonyms:CHEMBL407628 | DiCyclo (4-10/5,5'-8) [Ac-D Nal, D Cpa, D Pal, Asp, Glu(His), D Arg, Leu, Dbu, Pro, Dpr]GnRH
TypeSmall organic molecule
Emp. Form.C62H87ClN20O14
Mol. Mass.1371.933
SMILESCC[C@H](NC(C)=O)C(=O)N[C@@H](Cc1ccc(Cl)cc1)C(=O)N[C@@H](Cc1cccnc1)C(=O)N[C@H]1CC(=O)NCC(NC(=O)[C@@H]2CCCN2C(=O)C2CCNC(=O)[C@@H](Cc3cnc[nH]3)NC(=O)CC[C@H](NC1=O)C(=O)N[C@@H](CCCNC(N)=N)C(=O)N[C@H](CC(C)C)C(=O)N2)C(N)=O